{"text_format":"1","workbook":"xlsx","n_sheets":4,"sheets":["入力シート","入力例","入力チェック後","リスト"],"not_rendered":{"charts":0,"images":0,"macros":1,"external_links":0,"defined_names":2,"comments":0,"pivot_tables":0},"unopened":[],"bounds":{"document_bytes":16777216,"sheet_cells":100000,"rows_first":2000,"rows_last":500,"rows_between":2000,"halvings":0,"cell_chars":16384,"cell_head_chars":4096},"cells_cut":0,"cells_raw":0,"read":"whole","date_system":"1900"}

{"sheet":"入力シート","index":0,"n_rows":1,"n_cols":14,"rows_kept":1,"cut":false,"hidden":false,"merged":[]}
["自治体名","分析年度","試料番号 ","食品名","食品名\n（その他の場合）","国産・輸入","輸出国名","有害化学物質名","有害化学物質名（その他の場合）","分析法の妥当性","検出","検出限界","分析値","違反"]

{"sheet":"入力例","index":1,"n_rows":37,"n_cols":14,"rows_kept":37,"cut":false,"hidden":false,"merged":[]}
["自治体名","分析年度","試料番号 ","食品名","食品名\n（その他の場合）","国産・輸入","輸出国名","有害化学物質名","有害化学物質名（その他の場合）","分析法の妥当性","検出","検出限界","分析値","違反"]
["国立医薬品食品衛生研究所",2024,"A","いちご",null,"国産",null,"ＥＰＮ",null,null,null,0.01]
["国立医薬品食品衛生研究所",null,null,null,null,null,null,"ＸＭＣ",null,null,null,0.01]
["国立医薬品食品衛生研究所",null,null,null,null,null,null,"アクリナトリン",null,null,null,0.01]
["国立医薬品食品衛生研究所",null,null,null,null,null,null,"アセトクロール",null,null,null,0.01]
["国立医薬品食品衛生研究所",null,null,null,null,null,null,"アトラジン",null,null,null,0.01]
["国立医薬品食品衛生研究所",null,null,null,null,null,null,"アニロホス",null,null,null,0.01]
["国立医薬品食品衛生研究所",null,null,null,null,null,null,"アラクロール",null,null,null,0.01]
["国立医薬品食品衛生研究所",null,null,null,null,null,null,"イソキサチオン",null,null,null,0.01]
["国立医薬品食品衛生研究所",null,null,null,null,null,null,"イソプロカルブ",null,null,null,0.01]
["国立医薬品食品衛生研究所",null,null,null,null,null,null,"イソプロチオラン",null,null,null,0.01]
["国立医薬品食品衛生研究所",null,null,null,null,null,null,"イプロベンホス",null,null,null,0.01]
["国立医薬品食品衛生研究所",null,null,null,null,null,null,"イミダクロプリド",null,null,null,0.01]
["国立医薬品食品衛生研究所",null,"B","牛の筋肉",null,"国産",null,"エトリムホス",null,null,null,0.01]
["国立医薬品食品衛生研究所",null,null,null,null,null,null,"エンドリン",null,null,null,0.01]
["国立医薬品食品衛生研究所",null,null,null,null,null,null,"キナルホス",null,null,null,0.01]
["国立医薬品食品衛生研究所",null,null,null,null,null,null,"キントゼン",null,null,null,0.01]
["国立医薬品食品衛生研究所",null,null,null,null,null,null,"クマホス",null,null,null,0.01]
["国立医薬品食品衛生研究所",null,null,null,null,null,null,"クロルデン",null,null,null,0.01]
["国立医薬品食品衛生研究所",null,null,null,null,null,null,"クロルピリホス",null,null,null,0.01]
["国立医薬品食品衛生研究所",null,null,null,null,null,null,"クロルピリホスメチル",null,null,null,0.01]
["国立医薬品食品衛生研究所",null,null,null,null,null,null,"クロルフェンビンホス",null,null,null,0.01]
["国立医薬品食品衛生研究所",null,null,null,null,null,null,"クロロベンジレート",null,null,null,0.01]
["国立医薬品食品衛生研究所",null,null,null,null,null,null,"ジオキサベンゾフォス",null,null,null,0.01]
["国立医薬品食品衛生研究所",null,null,null,null,null,null,"シアノフェンホス",null,null,null,0.01]
["国立医薬品食品衛生研究所",null,"C","グレープフルーツ",null,"輸入","アメリカ","クロマゾン",null,null,null,3.0000000000000001E-3]
["国立医薬品食品衛生研究所",null,null,null,null,null,null,"クロルエトキシホス",null,null,null,3.0000000000000001E-3]
["国立医薬品食品衛生研究所",null,null,null,null,null,null,"クロルタールジメチル",null,null,null,3.0000000000000001E-3]
["国立医薬品食品衛生研究所",null,null,null,null,null,null,"クロルデン",null,null,null,3.0000000000000001E-3]
["国立医薬品食品衛生研究所",null,null,null,null,null,null,"クロルピリホス",null,null,1,3.0000000000000001E-3,0.02]
["国立医薬品食品衛生研究所",null,null,null,null,null,null,"クロルピリホスメチル",null,null,null,3.0000000000000001E-3]
["国立医薬品食品衛生研究所",null,null,null,null,null,null,"クロルフェナピル",null,null,null,3.0000000000000001E-3]
["国立医薬品食品衛生研究所",null,null,null,null,null,null,"クロルフェンソン",null,null,null,3.0000000000000001E-3]
["国立医薬品食品衛生研究所",null,null,null,null,null,null,"クロルフェンビンホス",null,null,null,3.0000000000000001E-3]
["国立医薬品食品衛生研究所",null,null,null,null,null,null,"クロルブファム",null,null,null,0.01]
["国立医薬品食品衛生研究所",null,null,null,null,null,null,"クロルプロファム",null,null,null,3.0000000000000001E-3]
["国立医薬品食品衛生研究所",null,null,null,null,null,null,"イミダクロプリド",null,null,null,3.0000000000000001E-3]

{"sheet":"入力チェック後","index":2,"n_rows":37,"n_cols":14,"rows_kept":37,"cut":false,"hidden":false,"merged":[]}
["自治体名","分析年度","試料番号 ","食品名","食品名\n（その他の場合）","国産・輸入","輸出国名","有害化学物質名","有害化学物質名（その他の場合）","分析法の妥当性","検出","検出限界","分析値","違反"]
["国立医薬品食品衛生研究所",2024,"A","いちご",null,"国産",null,"ＥＰＮ",null,null,null,0.01,5.0000000000000001E-3]
["国立医薬品食品衛生研究所",2024,"A","いちご",null,"国産",null,"ＸＭＣ",null,null,null,0.01,5.0000000000000001E-3]
["国立医薬品食品衛生研究所",2024,"A","いちご",null,"国産",null,"アクリナトリン",null,null,null,0.01,5.0000000000000001E-3]
["国立医薬品食品衛生研究所",2024,"A","いちご",null,"国産",null,"アセトクロール",null,null,null,0.01,5.0000000000000001E-3]
["国立医薬品食品衛生研究所",2024,"A","いちご",null,"国産",null,"アトラジン",null,null,null,0.01,5.0000000000000001E-3]
["国立医薬品食品衛生研究所",2024,"A","いちご",null,"国産",null,"アニロホス",null,null,null,0.01,5.0000000000000001E-3]
["国立医薬品食品衛生研究所",2024,"A","いちご",null,"国産",null,"アラクロール",null,null,null,0.01,5.0000000000000001E-3]
["国立医薬品食品衛生研究所",2024,"A","いちご",null,"国産",null,"イソキサチオン",null,null,null,0.01,5.0000000000000001E-3]
["国立医薬品食品衛生研究所",2024,"A","いちご",null,"国産",null,"イソプロカルブ",null,null,null,0.01,5.0000000000000001E-3]
["国立医薬品食品衛生研究所",2024,"A","いちご",null,"国産",null,"イソプロチオラン",null,null,null,0.01,5.0000000000000001E-3]
["国立医薬品食品衛生研究所",2024,"A","いちご",null,"国産",null,"イプロベンホス",null,null,null,0.01,5.0000000000000001E-3]
["国立医薬品食品衛生研究所",2024,"A","いちご",null,"国産",null,"イミダクロプリド",null,null,null,0.01,5.0000000000000001E-3]
["国立医薬品食品衛生研究所",2024,"B","牛の筋肉",null,"国産",null,"エトリムホス",null,null,null,0.01,5.0000000000000001E-3]
["国立医薬品食品衛生研究所",2024,"B","牛の筋肉",null,"国産",null,"エンドリン",null,null,null,0.01,5.0000000000000001E-3]
["国立医薬品食品衛生研究所",2024,"B","牛の筋肉",null,"国産",null,"キナルホス",null,null,null,0.01,5.0000000000000001E-3]
["国立医薬品食品衛生研究所",2024,"B","牛の筋肉",null,"国産",null,"キントゼン",null,null,null,0.01,5.0000000000000001E-3]
["国立医薬品食品衛生研究所",2024,"B","牛の筋肉",null,"国産",null,"クマホス",null,null,null,0.01,5.0000000000000001E-3]
["国立医薬品食品衛生研究所",2024,"B","牛の筋肉",null,"国産",null,"クロルデン",null,null,null,0.01,5.0000000000000001E-3]
["国立医薬品食品衛生研究所",2024,"B","牛の筋肉",null,"国産",null,"クロルピリホス",null,null,null,0.01,5.0000000000000001E-3]
["国立医薬品食品衛生研究所",2024,"B","牛の筋肉",null,"国産",null,"クロルピリホスメチル",null,null,null,0.01,5.0000000000000001E-3]
["国立医薬品食品衛生研究所",2024,"B","牛の筋肉",null,"国産",null,"クロルフェンビンホス",null,null,null,0.01,5.0000000000000001E-3]
["国立医薬品食品衛生研究所",2024,"B","牛の筋肉",null,"国産",null,"クロロベンジレート",null,null,null,0.01,5.0000000000000001E-3]
["国立医薬品食品衛生研究所",2024,"B","牛の筋肉",null,"国産",null,"ジオキサベンゾフォス",null,null,null,0.01,5.0000000000000001E-3]
["国立医薬品食品衛生研究所",2024,"B","牛の筋肉",null,"国産",null,"シアノフェンホス",null,null,null,0.01,5.0000000000000001E-3]
["国立医薬品食品衛生研究所",2024,"C","グレープフルーツ",null,"輸入","アメリカ","クロマゾン",null,null,null,3.0000000000000001E-3,1.5E-3]
["国立医薬品食品衛生研究所",2024,"C","グレープフルーツ",null,"輸入","アメリカ","クロルエトキシホス",null,null,null,3.0000000000000001E-3,1.5E-3]
["国立医薬品食品衛生研究所",2024,"C","グレープフルーツ",null,"輸入","アメリカ","クロルタールジメチル",null,null,null,3.0000000000000001E-3,1.5E-3]
["国立医薬品食品衛生研究所",2024,"C","グレープフルーツ",null,"輸入","アメリカ","クロルデン",null,null,null,3.0000000000000001E-3,1.5E-3]
["国立医薬品食品衛生研究所",2024,"C","グレープフルーツ",null,"輸入","アメリカ","クロルピリホス",null,null,1,3.0000000000000001E-3,0.02]
["国立医薬品食品衛生研究所",2024,"C","グレープフルーツ",null,"輸入","アメリカ","クロルピリホスメチル",null,null,null,3.0000000000000001E-3,1.5E-3]
["国立医薬品食品衛生研究所",2024,"C","グレープフルーツ",null,"輸入","アメリカ","クロルフェナピル",null,null,null,3.0000000000000001E-3,1.5E-3]
["国立医薬品食品衛生研究所",2024,"C","グレープフルーツ",null,"輸入","アメリカ","クロルフェンソン",null,null,null,3.0000000000000001E-3,1.5E-3]
["国立医薬品食品衛生研究所",2024,"C","グレープフルーツ",null,"輸入","アメリカ","クロルフェンビンホス",null,null,null,3.0000000000000001E-3,1.5E-3]
["国立医薬品食品衛生研究所",2024,"C","グレープフルーツ",null,"輸入","アメリカ","クロルブファム",null,null,null,0.01,5.0000000000000001E-3]
["国立医薬品食品衛生研究所",2024,"C","グレープフルーツ",null,"輸入","アメリカ","クロルプロファム",null,null,null,3.0000000000000001E-3,1.5E-3]
["国立医薬品食品衛生研究所",2024,"C","グレープフルーツ",null,"輸入","アメリカ","イダクロプリド",null,null,null,3.0000000000000001E-3,1.5E-3]

{"sheet":"リスト","index":3,"n_rows":1697,"n_cols":30,"rows_kept":1697,"cut":false,"hidden":true,"merged":[]}
["食品名","有害化学物質名",null,null,null,{"$f":"COUNTIF(F2:F1696,\"error\")","v":1},{"$f":"COUNTIF(G2:G1696,\"error\")","v":1},null,null,"データ数","試料名数","自治体:試料","試料:食品","試料＋農薬",null,"自治体:食品",null,null,null,"カウント"]
["玄米","［モノ，ビス（塩化トリメチルアンモニウムメチレン）］－アルキルトルエン",null,null,null,{"$f":"IFERROR(MATCH(入力シート!D2,$A$2:$A$1698,0),\"error\")","v":"error"},{"$f":"IFERROR(MATCH(入力シート!H2,$B$2:$B$1401,0),\"error\")","v":"error"},null,null,{"$f":"COUNTA(入力シート!C2:C80002)","v":0},{"$f":"COUNTA(_xlfn.UNIQUE(OFFSET(入力シート!$C$2,0,0,$J$2,1)))","v":1},{"$f":"COUNTA(_xlfn.UNIQUE(OFFSET(入力シート!$A$2,0,0,$J$2,3)))/3","v":0.33333333333333331},{"$f":"COUNTA(_xlfn.UNIQUE(OFFSET(入力シート!$A$2,0,0,$J$2,4)))/4","v":0.25},{"$f":"COUNTA(_xlfn.UNIQUE(OFFSET(入力シート!$A$2,0,0,$J$2,8)))/8","v":0.125},null,{"$f":"_xlfn.UNIQUE(OFFSET(入力シート!$A$2,0,0,$J$2,4))","v":{"$error":"#REF!"}},null,null,null,{"$f":"COUNTIFS($P$2:$P$1696,P2,$R$2:$R$1696,R2)","v":0},null,{"$f":"_xlfn.UNIQUE(OFFSET(入力シート!$A$2,0,0,$J$2,8))","v":{"$error":"#REF!"}},null,null,null,null,null,null,null,{"$f":"COUNTIFS(入力シート!$A$2:$A$20002,リスト!V2,入力シート!$C$2:$C$20002,リスト!X2,入力シート!$H$2:$H$20002,リスト!AC2)","v":0}]
["小麦","１，２－ジクロロプロパン"]
["大麦","１，２－ジブロモ－３－クロロプロパン"]
["ライ麦","１，２－ジブロモエタン"]
["スイートコーン","１，３－ジクロロプロペン"]
["スイートコーン（冷凍）","１，４－ジメチルナフタレン"]
["ジャイアントコーン","１－ナフタレン酢酸"]
["テオシント","１－メチルシクロプロペン"]
["とうもろこし","２，４，５－Ｔ"]
["ポップコーン","２，４－ＤＢ"]
["未成熟とうもろこし","２，４－ジクロロフェノキシ酢酸"]
["そば","２，６－ジイソプロピルナフタレン"]
["その他の穀類","３－ニトロオキシプロパノール"]
["ジュズダマ","４－クロルフェノキシ酢酸"]
["アマランサス","ＢＨＣ"]
["アメリカマコモ","ＤＢＥＤＣ"]
["あわ","ＤＣＩＰ"]
["オート麦","ＤＤＴ"]
["エン麦","ＥＰＮ"]
["カラス麦","ＥＰＴＣ"]
["カニューア","ＭＣＰＡ"]
["きび","ＭＣＰＢ"]
["砂糖もろこし","γ－ＢＨＣ"]
["ソルガム","アイオキシニル"]
["こうりゃん","アクリナトリン"]
["はとむぎ","アザペロン"]
["ヨクイニン","アシノナピル"]
["ひえ","アシフルオルフェン"]
["モロコシ","アシベンゾラルＳ－メチル"]
["キノア","アジムスルフロン"]
["ワイルドライス","アシュラム"]
["乾燥大豆","アジンホスメチル"]
["黒大豆","アスポキシシリン"]
["茶大豆","アセキノシル"]
["緑大豆","アセタミプリド"]
["大豆","アセトアミノフェン"]
["小豆類","アセトクロール"]
["小豆","アセフェート"]
["いんげん","アゾキシストロビン"]
["大手亡豆","アゾシクロチン及びシヘキサチン"]
["手亡豆","アトラジン"]
["金時豆","アバメクチン"]
["ささげ","アビラマイシン"]
["白いんげん","アフィドピロペン"]
["黒いんげん","アプラマイシン"]
["赤いんげん","アミスルブロム"]
["竹小豆","アミトラズ"]
["バター豆","アミトロール"]
["ふじ豆","アミノエトキシビニルグリシン"]
["べにばないんげん","アミノシクロピラクロル"]
["ベビーライマ豆","アミノピラリド"]
["ライマ豆","アメトクトラジン"]
["緑豆","アメトリン"]
["レンズ豆","アモキシシリン"]
["えんどう","アラクロール"]
["そら豆","アラニカルブ"]
["らっかせい","アルジカルブ及びアルドキシカルブ"]
["その他の豆類","アルドリン及びディルドリン"]
["カリオカビーンズ","アルトレノゲスト"]
["補骨脂","アルベンダゾール"]
["たちなた豆","アレスリン"]
["なた豆","アンピシリン"]
["ルピン豆","アンプロリウム"]
["キマメ","イオドスルフロンメチル"]
["アラハル豆","イソウロン"]
["ひよこ豆","イソオイゲノール"]
["トラッパーピース","イソキサジフェンエチル"]
["ばれいしょ","イソキサチオン"]
["ばれいしょ（冷凍）","イソキサフルトール"]
["さといも類","イソシンコメロン酸二プロピル"]
["さといも","イソチアニル"]
["京芋","イソピラザム"]
["えびいも","イソフェタミド"]
["はすいも","イソフェンホス"]
["クワズイモ","イソプロカルブ"]
["タロイモ","イソプロチオラン"]
["みずいも","イソプロツロン"]
["さといも類（冷凍）","イソメタミジウム"]
["さといも（冷凍）","イナベンフィド"]
["かんしょ","イプフェンカルバゾン"]
["かんしょ（冷凍）","イプフルフェノキン"]
["ながいも","イプロジオン"]
["まるいも","イプロニダゾール"]
["やまといも","イプロバリカルブ"]
["やまいも","イプロベンホス"]
["やまのいも","イベルメクチン"]
["ヤムイモ","イマザキン"]
["つくねいも","イマザピック"]
["じねんじょ","イマザピル"]
["やまいも（冷凍）","イマザモックスアンモニウム塩"]
["こんにゃくいも","イマザリル"]
["こんにゃくいも（冷凍）","イマゼタピルアンモニウム塩"]
["その他のいも類","イマゾスルフロン"]
["アメリカホドイモ","イミシアホス"]
["アピオス","イミダクロプリド"]
["きくいも","イミドカルブ"]
["ヤーコン","イミノクタジン"]
["キャッサバ","イミベンコナゾール"]
["クズウコン","インダノファン"]
["キャッサバ（冷凍）","インドキサカルブ"]
["その他のいも類（冷凍）","インピルフルキサム"]
["てんさい","ウニコナゾール－Ｐ"]
["てんさい（冷凍）","エスプロカルブ"]
["さとうきび","エタボキサム"]
["さとうきび（冷凍）","エタメツルフロンメチル"]
["だいこんの根","エタルフルラリン"]
["ラディッシュの根","エチオン"]
["はつかだいこんの根","エチクロゼート"]
["だいこんの根（冷凍）","エチプロール"]
["だいこんの葉","エディフェンホス"]
["ラディッシュの葉","エテホン"]
["はつかだいこんの葉","エトキサゾール"]
["だいこんの葉（冷凍）","エトキシキン"]
["かぶの根","エトキシスルフロン"]
["ルタバガの根","エトパベート"]
["ルタバガの葉","エトフェンプロックス"]
["かぶの根（冷凍）","エトフメセート"]
["ルタバガの根（冷凍）","エトプロホス"]
["かぶの葉","エトベンザニド"]
["ホースラディッシュ","エトリジアゾール"]
["かぶの葉（冷凍）","エノキサシン"]
["西洋わさび","エプリノメクチン"]
["西洋わさび（冷凍）","エフロトマイシン"]
["クレソン","エポキシコナゾール"]
["クレソン（冷凍）","エマメクチン安息香酸塩"]
["はくさい","エリスロマイシン"]
["はくさい（冷凍）","塩化ジデシルジメチルアンモニウム"]
["キャベツ","塩酸ホルメタネート"]
["グリーンボール","エンドスルファン"]
["チリメンキャベツ","エンドリン"]
["サボイキャベツ","エンラマイシン"]
["レッドキャベツ","エンロフロキサシン"]
["キャベツ（冷凍）","オイゲノール"]
["芽キャベツ","オキサジアゾン"]
["芽キャベツ（冷凍）","オキサジアルギル"]
["ケール","オキサジキシル"]
["葉キャベツ","オキサジクロメホン"]
["コラード","オキサシリン"]
["ケール（冷凍）","オキサゾスルフィル"]
["コラード（冷凍）","オキサチアピプロリン"]
["こまつな","オキサミル"]
["こまつな（冷凍）","オキシクロザニド"]
["みずな","オキシテトラサイクリン"]
["みぶな","オキシテトラサイクリン、クロルテトラサイクリン及びテトラサイクリン"]
["きょうな","オキシデメトンメチル"]
["きょうな（冷凍）","オキシフルオルフェン"]
["チンゲンサイ","オキシン銅"]
["チンゲンサイ（冷凍）","オキスポコナゾールフマル酸塩"]
["カリフラワー","オキソリニック酸"]
["カリフラワー（冷凍）","オクスフェンダゾール、フェバンテル及びフェンベンダゾール"]
["ブロッコリー","オフロキサシン"]
["ブロッコリー（冷凍）","オメトエート"]
["朝熊小菜","オラキンドックス"]
["あざみな","オリサストロビン"]
["あじみな","オリザリン"]
["アスパラ菜","オルトジクロロベンゼン"]
["あぶらなの葉","オルトフェニルフェノール"]
["エイ菜","オルビフロキサシン"]
["おおさきな","オルメトプリム"]
["オータムポエム","オレアンドマイシン"]
["かいわれだいこん","カスガマイシン"]
["かきな","カズサホス"]
["空心菜","カナマイシン"]
["くきたちな","カフェンストロール"]
["茎ブロッコリー","カプタホール"]
["こうさいたい","ガミスロマイシン"]
["コールラビ","カラゾロール"]
["さいしん","カルタップ、チオシクラム及びベンスルタップ"]
["さぬきな","カルバドックス"]
["山東菜","カルバリル"]
["しろな","カルフェントラゾンエチル"]
["スティックセニョール","カルプロパミド"]
["せいさい","カルプロフェン"]
["仙台芭蕉菜","カルベンダジム、チオファネート、チオファネートメチル及びベノミル"]
["仙台雪菜","カルボキシン"]
["その他のあぶらな科野菜","カルボスルファン"]
["タアサイ","カルボフラン"]
["たいさい","カンタキサンチン"]
["たかな","キザロホップエチル及びキザロホップＰテフリル"]
["ちぢみな","キシラジン"]
["とうな","キタサマイシン"]
["長崎はくさい","キナルホス"]
["なずな","キノキシフェン"]
["菜の花","キノクラミン"]
["のざわな","キノフメリン"]
["はくさいな","キノメチオナート"]
["花チンゲンサイ","キャプタン"]
["はなっこりー","キンクロラック"]
["花菜","キントゼン"]
["非結球メキャベツ","クマホス"]
["広島菜","クミルロン"]
["プチベール","クラブラン酸"]
["マカ","グリカルピラミド"]
["マスタードスプラウト","グリチルリチン酸"]
["大和まな","グリホサート"]
["ルッコラ","グルホシネート"]
["わさびの根茎","クレソキシムメチル"]
["さいしん（冷凍）","クレトジム"]
["ルッコラ（冷凍）","クレンブテロール"]
["菜の花（冷凍）","クロキサシリン"]
["その他のあぶらな科野菜（冷凍）","クロキントセットメキシル"]
["ごぼう","クロサンテル"]
["ごぼう（冷凍）","クロジナホッププロパルギル"]
["サルシフィー","クロチアニジン"]
["サルシフィー（冷凍）","クロピドール"]
["アーティチョーク","クロピラリド"]
["アーティチョーク（冷凍）","クロフェンテジン"]
["チコリ","クロマゾン"]
["チコリ（冷凍）","クロマフェノジド"]
["エンダイブ","クロメプロップ"]
["エンダイブ（冷凍）","クロラムフェニコール"]
["しゅんぎく","クロランスラムメチル"]
["しゅんぎく（冷凍）","クロラントラニリプロール"]
["かきちしゃ","クロリダゾン"]
["グリーンリーフ","クロリムロンエチル"]
["サンチュ","クロルスルフロン"]
["サニーレタス","クロルスロン"]
["サラダ菜","クロルタールジメチル"]
["ちしゃ","クロルテトラサイクリン"]
["リーフレタス","クロルデン"]
["レタス","クロルピクリン"]
["ロメインレタス","クロルピリホス"]
["かきちしゃ（冷凍）","クロルピリホスメチル"]
["サラダ菜（冷凍）","クロルフェナピル"]
["ちしゃ（冷凍）","クロルフェンビンホス"]
["レタス（冷凍）","クロルフルアズロン"]
["その他のきく科野菜","クロルプロファム"]
["やまごぼう","クロルプロマジン"]
["ごぼうの葉","クロルヘキシジン"]
["葉ごぼう","クロルマジノン"]
["サルシフィーの葉","クロルメコート"]
["チコリの根","クロロタロニル"]
["トレビス","クロロトルロン"]
["きくの葉","ケトプロフェン"]
["食用菊","ケベマイシン"]
["金時草","ゲンタマイシン"]
["ふき","ゲンチアナバイオレット"]
["ふきのとう","コリスチン"]
["よめな","酢酸イソ吉草酸タイロシン"]
["その他のきく科野菜（冷凍）","酢酸トレンボロン"]
["たまねぎ","酢酸メレンゲステロール"]
["ペコロス","サフルフェナシル"]
["たまねぎ（冷凍）","サラフロキサシン"]
["ねぎ","サリノマイシン"]
["リーキ","酸化プロピレン"]
["リーキ（冷凍）","シアゾファミド"]
["ねぎ（冷凍）","シアナジン"]
["にんにく","シアノホス"]
["にんにく（冷凍）","ジアフェンチウロン"]
["にら","ジアベリジン"]
["にら（冷凍）","シアン化水素"]
["アスパラガス","シアントラニリプロール"]
["グリーンアスパラガス","ジウロン"]
["ホワイトアスパラガス","ジエチルスチルベストロール"]
["グリーンアスパラガス（冷凍）","ジエトフェンカルブ"]
["ホワイトアスパラガス（冷凍）","シエノピラフェン"]
["わけぎ","ジカンバ"]
["わけぎ（冷凍）","ジクラズリル"]
["その他のゆり科野菜","シクラニリド"]
["アロエ","シクラニリプロール"]
["うるい","ジクロキサシリン"]
["ぎょうじゃにんにく","シクロキシジム"]
["ニラの花","ジクロシメット"]
["にんにくの茎","ジクロスラム"]
["のびる","シクロスルファムロン"]
["葉たまねぎ","ジクロトホス"]
["葉にんにく","シクロピラニル"]
["ホンカンゾウ","シクロピリモレート"]
["ヤブカンゾウ","ジクロフルアニド"]
["ゆり根","シクロプロトリン"]
["らっきょう","ジクロベニル"]
["食用ゆり","ジクロベンチアゾクス"]
["にんにくの茎（冷凍）","ジクロホップメチル"]
["その他のゆり科野菜（冷凍）","ジクロメジン"]
["葉たまねぎ（冷凍）","ジクロラン"]
["にんじん","ジクロルプロップ"]
["ミニキャロット","ジクロルボス及びナレド"]
["にんじん（冷凍）","ジクロロイソシアヌル酸"]
["パースニップ","ジクロロメゾチアズ"]
["オランダボウフウ","ジクワット"]
["パースニップ（冷凍）","ジコホール"]
["パセリの茎・葉","ジシクラニル"]
["パセリの茎・葉（冷凍）","ジスルホトン"]
["パセリの種子","ジチアノン"]
["セロリの茎・葉","ジチオカルバメート"]
["セロリの茎・葉（冷凍）","ジチオピル"]
["みつば","ジニトルミド"]
["みつば（冷凍）","シニドンエチル"]
["その他のせり科野菜","ジノカップ"]
["あしたば","ジノテフラン"]
["オオバコエンドロ","シハロトリン"]
["せり","シハロホップブチル"]
["セルリアック","ジヒドロストレプトマイシン"]
["にんじんの葉","ジヒドロストレプトマイシン及びストレプトマイシン"]
["ぼうふう","ジフェニル"]
["その他のせり科野菜（冷凍）","ジフェニルアミン"]
["オオバコエンドロ（冷凍）","ジフェノコナゾール"]
["セルリアック（冷凍）","シフェノトリン"]
["せり（冷凍）","ジフェンゾコート"]
["トマト","ジブチルサクシネート"]
["ミニトマト","ジブチルヒドロキシトルエン"]
["トマト（冷凍）","シフルトリン"]
["ミニトマト（冷凍）","シフルフェナミド"]
["ジャンボピーマン","ジフルフェニカン"]
["ピーマン","ジフルフェンゾピル"]
["パプリカ","ジフルベンズロン"]
["パプリカ（冷凍）","シフルメトフェン"]
["カラーピーマン","ジフロキサシン"]
["ピーマン（冷凍）","シプロコナゾール"]
["なす","シプロジニル"]
["なす（冷凍）","シペルメトリン"]
["その他のなす科野菜","ジベレリン"]
["青とうがらし","シマジン"]
["甘長とうがらし","ジミナゼン"]
["かぐらなんばん","シメコナゾール"]
["きだちとうがらし","ジメスルファゼット"]
["クコ","ジメタメトリン"]
["ししとう","ジメチピン"]
["とうがらし","ジメチルビンホス"]
["とうがらしの葉","ジメテナミド"]
["なんばん","ジメトエート"]
["ハバネロ","ジメトモルフ"]
["パプリカ（香辛料として用いられるもの）","ジメトリダゾール"]
["ハラペーニョ","シメトリン"]
["食用ほおずき","シモキサニル"]
["青とうがらし（冷凍）","臭素"]
["とうがらし（冷凍）","ジョサマイシン"]
["ししとう（冷凍）","シラフルオフェン"]
["その他のなす科野菜（冷凍）","ジルパテロール"]
["ガーキン","シロマジン"]
["きゅうり","ジンプロピリダズ"]
["きゅうり（冷凍）","シンメチリン"]
["ウインタースカッシュ","ストレプトマイシン"]
["かぼちゃ","スピネトラム"]
["サマ－スカッシュ","スピノサド"]
["スカッシュ","スピラマイシン"]
["ズッキーニ","スピロキサミン"]
["そうめんかぼちゃ","スピロジクロフェン"]
["金糸瓜","スピロテトラマト"]
["かぼちゃ（冷凍）","スピロメシフェン"]
["あおうり","スペクチノマイシン"]
["しろうり","スルファエトキシピリダジン"]
["しろうり（冷凍）","スルファキノキサリン"]
["すいか","スルファグアニジン"]
["すいかの種","スルファクロルピリダジン"]
["すいか（冷凍）","スルファジアジン"]
["すいかの種（冷凍）","スルファジミジン"]
["カンタロープ","スルファジメトキシン"]
["ハミウリ","スルファセタミド"]
["マスクメロン","スルファチアゾール"]
["メロン","スルファドキシン"]
["ハネジューメロン","スルファトロキサゾール"]
["メロン類果実","スルファニトラン"]
["メロン類果実（冷凍）","スルファニルアミド"]
["まくわうり","スルファピリジン"]
["まくわうり（冷凍）","スルファブロモメタジンナトリウム"]
["その他のうり科野菜","スルファベンズアミド"]
["ゴーヤ","スルファメチゾール"]
["すいかの皮","スルファメトキサゾール"]
["ズッキーニの花","スルファメトキシジアジン"]
["とうがん","スルファメトキシピリダジン"]
["はやとうり","スルファメラジン"]
["ひょうたん","スルファモイルダプソン"]
["へちま","スルファモノメトキシン"]
["未成熟すいか","スルファレート"]
["ゆうがお","スルフイソキサゾール"]
["ゴーヤ（冷凍）","スルフイソゾール"]
["その他のうり科野菜（冷凍）","スルフイソミジン"]
["ほうれんそう","スルフェントラゾン"]
["ほうれんそう（冷凍）","スルホキサフロル"]
["たけのこ","スルホスルフロン"]
["たけのこ（冷凍）","セダキサン"]
["オクラ","セデカマイシン"]
["オクラ（冷凍）","セトキシジム"]
["しょうが","セファセトリル"]
["葉しょうが","セファゾリン"]
["しょうが（冷凍）","セファピリン"]
["未成熟えんどう","セファレキシン"]
["グリーンピース","セファロニウム"]
["さやえんどう","セフォペラゾン"]
["きぬさや","セフキノム"]
["未成熟えんどう（冷凍）","セフチオフル"]
["グリーンピース（冷凍）","セフロキシム"]
["未成熟いんげん","ゼラノール"]
["モロッコインゲン","センデュラマイシン"]
["未成熟いんげん（冷凍）","ゾキサミド"]
["えだまめ","ターバシル"]
["えだまめ（冷凍）","ダイアジノン"]
["マッシュルーム","ダイムロン"]
["マッシュルーム（冷凍）","タイロシン"]
["しいたけ","ダゾメット、メタム及びメチルイソチオシアネート"]
["しいたけ（冷凍）","ダノフロキサシン"]
["その他のきのこ類","ダミノジッド"]
["アガリクス","チアクロプリド"]
["あわびたけ","チアジニル"]
["あんずたけ","チアゾピル"]
["えのきだけ","チアベンダゾール"]
["エリンギ","チアムリン"]
["きくらげ","チアメトキサム"]
{"$rows_left_out":1297}